Target
Plasmepsin II
Ligand
BDBM8009
Substrate
Peptide Substrate
Meas. Tech.
Enzyme Inhibition Measurements
pH
4.5±n/a
Temperature
295.15±n/a K
Ki
181±n/a nM
Citation
 Ersmark, KFeierberg, IBjelic, SHamelink, EHackett, FBlackman, MJHulten, JSamuelsson, BAqvist, JHallberg, A Potent inhibitors of the Plasmodium falciparum enzymes plasmepsin I and II devoid of cathepsin D inhibitory activity. J Med Chem 47:110-22 (2004)  
Target
Name:
Plasmepsin II
Synonyms:
Aspartic hemoglobinase II PLM2_PLAFX Plasmepsin 2 Plasmepsin-II
Type:
Enzyme
Mol. Mass.:
51482.09
Organism:
Plasmodium falciparum
Description:
P46925
Residue:
453
  
Inhibitor
Name:
BDBM8009
Synonyms:
(2R,3R,4R,5R)-2,5-bis({[(2E)-3-(3,5-dimethyl-1,2-oxazol-4-yl)prop-2-en-1-yl]oxy})-3,4-dihydroxy-N,N'-bis[(1S,2R)-2-hydroxy-2,3-dihydro-1H-inden-1-yl]hexanediamide C2-symmetric compound 17
Type:
Small organic molecule
Emp. Form.:
C40H46N4O10
Mol. Mass.:
742.814
SMILES:
Cc1noc(C)c1\C=C\CO[C@H]([C@H](O)[C@@H](O)[C@@H](OC\C=C\c1c(C)noc1C)C(=O)N[C@@H]1[C@H](O)Cc2ccccc12)C(=O)N[C@@H]1[C@H](O)Cc2ccccc12
:
Substrate
Name:
Peptide Substrate
Synonyms:
Type:
Peptide
Mol. Mass.:
3501.67
Organism:
Description:
Residue:
31