Target
cAMP-specific 3',5'-cyclic phosphodiesterase 4B
Ligand
BDBM285603
Substrate
IC50
5.43±n/a nM
Citation
 Chappie, TAVerhoest, PRPatel, NCHayward, MMHelal, CJSciabola, SLaChapelle, EAYoung, JM Imidazopyridazine compounds US Patent  US9598421 Publication Date 3/21/2017 
Target
Name:
cAMP-specific 3',5'-cyclic phosphodiesterase 4B
Synonyms:
3',5'-cyclic phosphodiesterase Isoform PDE4B1 PDE4B PDE4B_HUMAN Phosphodiesterase 4B (PDE4B) Phosphodiesterase Type 4 (PDE4B)
Type:
Protein
Mol. Mass.:
83318.87
Organism:
Homo sapiens (Human)
Description:
Q07343
Residue:
736
  
Inhibitor
Name:
BDBM285603
Synonyms:
US10077269, Example 76 US9598421, Example 76 | azetidin-1-yl{3-[2-(difluoro-methoxy)pyridin-4-yl]imidazo[1,2-b]pyridazin-2-yl}methanone
Type:
Small organic molecule
Emp. Form.:
C16H13F2N5O2
Mol. Mass.:
345.3035
SMILES:
FC(F)Oc1cc(ccn1)-c1c(nc2cccnn12)C(=O)N1CCC1
: