Target
cAMP-specific 3',5'-cyclic phosphodiesterase 4B
Ligand
BDBM285611
Substrate
IC50
9.34±n/a nM
Citation
 Chappie, TAVerhoest, PRPatel, NCHayward, MMHelal, CJSciabola, SLaChapelle, EAYoung, JM Imidazopyridazine compounds US Patent  US9598421 Publication Date 3/21/2017 
Target
Name:
cAMP-specific 3',5'-cyclic phosphodiesterase 4B
Synonyms:
3',5'-cyclic phosphodiesterase Isoform PDE4B1 PDE4B PDE4B_HUMAN Phosphodiesterase 4B (PDE4B) Phosphodiesterase Type 4 (PDE4B)
Type:
Protein
Mol. Mass.:
83318.87
Organism:
Homo sapiens (Human)
Description:
Q07343
Residue:
736
  
Inhibitor
Name:
BDBM285611
Synonyms:
3-(4-chloro-3-fluorophenyl)-N-ethylimidazo[1,2-b]pyridazine-2-carboxamide US10669279, Example 81 | US9598421, Example 81
Type:
Small organic molecule
Emp. Form.:
C15H12ClFN4O
Mol. Mass.:
318.733
SMILES:
CCNC(=O)c1nc2cccnn2c1-c1ccc(Cl)c(F)c1
: