Target
Casein kinase I isoform delta
Ligand
BDBM302528
Substrate
Meas. Tech.
Kinase Assay
IC50
<10±n/a nM
Citation
 Velaparthi, UDarne, CPLiu, PWittman, MDPearce, BCAraujo, EMDasgupta, BNair, JSJanakiraman, SKRachamreddy, CRMettu, MRKaruppiah, AMReddy, BSNagalakshmi, PBora, ROMaheshwarappa, SHKumaravel, SMullick, DSistla, R Substituted 4,5,6,7-tetrahydropyrazolo[1,5-A]pyrazine derivatives as casein kinase 1 D/E inhibitors US Patent  US9598423 Publication Date 3/21/2017 
Target
Name:
Casein kinase I isoform delta
Synonyms:
CKI-delta CSNK1D Casein kinase I delta Casein kinase I isoform delta (CK1D) KC1D_HUMAN | casein kinases 1 delta (CK1 delta)
Type:
Enzyme
Mol. Mass.:
47356.76
Organism:
Homo sapiens (Human)
Description:
P48730
Residue:
415
  
Inhibitor
Name:
BDBM302528
Synonyms:
N5-(3-Fluoro-5- hydroxyadamantan-1-yl)- 2-(3-fluorophenyl)-6,7- dihydropyrazolo[1,5-a] pyrazine-3,5(4H)- dicarboxamide | US9598423, Example 94
Type:
Small organic molecule
Emp. Form.:
C24H27F2N5O3
Mol. Mass.:
471.4997
SMILES:
NC(=O)c1c2CN(CCn2nc1-c1cccc(F)c1)C(=O)NC12CC3CC(O)(CC(F)(C3)C1)C2
: