Target
Casein kinase I isoform delta
Ligand
BDBM302654
Substrate
Meas. Tech.
Kinase Assay
IC50
<10±n/a nM
Citation
 Velaparthi, UDarne, CPLiu, PWittman, MDPearce, BCAraujo, EMDasgupta, BNair, JSJanakiraman, SKRachamreddy, CRMettu, MRKaruppiah, AMReddy, BSNagalakshmi, PBora, ROMaheshwarappa, SHKumaravel, SMullick, DSistla, R Substituted 4,5,6,7-tetrahydropyrazolo[1,5-A]pyrazine derivatives as casein kinase 1 D/E inhibitors US Patent  US9598423 Publication Date 3/21/2017 
Target
Name:
Casein kinase I isoform delta
Synonyms:
CKI-delta CSNK1D Casein kinase I delta Casein kinase I isoform delta (CK1D) KC1D_HUMAN | casein kinases 1 delta (CK1 delta)
Type:
Enzyme
Mol. Mass.:
47356.76
Organism:
Homo sapiens (Human)
Description:
P48730
Residue:
415
  
Inhibitor
Name:
BDBM302654
Synonyms:
2-(3-Chloro-5- fluorophenyl)-N5-(4- cyano-3-methylphenyl)- 6,7-dihydropyrazolo[1,5- a]pyrazine-3,5(4H)- dicarboxamide | US9598423, Example 221
Type:
Small organic molecule
Emp. Form.:
C22H18ClFN6O2
Mol. Mass.:
452.869
SMILES:
Cc1cc(NC(=O)N2CCn3nc(c(C(N)=O)c3C2)-c2cc(F)cc(Cl)c2)ccc1[N+]#[C-]
: