Target
Casein kinase I isoform epsilon
Ligand
BDBM302662
Substrate
Meas. Tech.
Kinase Assay
IC50
<10±n/a nM
Citation
 Velaparthi, UDarne, CPLiu, PWittman, MDPearce, BCAraujo, EMDasgupta, BNair, JSJanakiraman, SKRachamreddy, CRMettu, MRKaruppiah, AMReddy, BSNagalakshmi, PBora, ROMaheshwarappa, SHKumaravel, SMullick, DSistla, R Substituted 4,5,6,7-tetrahydropyrazolo[1,5-A]pyrazine derivatives as casein kinase 1 D/E inhibitors US Patent  US9598423 Publication Date 3/21/2017 
Target
Name:
Casein kinase I isoform epsilon
Synonyms:
Axin-1/Casein kinase I epsilon CKIe Casein kinase 1 epsilon (CK1Ɛ) Casein kinase I isoform epsilon (CK1 epsilon) Casein kinase I isoform epsilon (CK1epsilon) | KC1E_HUMAN
Type:
Protein
Mol. Mass.:
47340.25
Organism:
Homo sapiens (Human)
Description:
P49674
Residue:
416
  
Inhibitor
Name:
BDBM302662
Synonyms:
N5-(3-Chloro-4- cyanophenyl)-2-(3-fluoro-5- methylphenyl)-6,7- dihydropyrazolo[1,5-a] pyrazine-3,5(4H)- dicarboxamide | US9598423, Example 230
Type:
Small organic molecule
Emp. Form.:
C22H18ClFN6O2
Mol. Mass.:
452.869
SMILES:
Cc1cc(F)cc(c1)-c1nn2CCN(Cc2c1C(N)=O)C(=O)Nc1ccc([N+]#[C-])c(Cl)c1
: