Target
Casein kinase I isoform epsilon
Ligand
BDBM302691
Substrate
Meas. Tech.
Kinase Assay
IC50
<10±n/a nM
Citation
 Velaparthi, UDarne, CPLiu, PWittman, MDPearce, BCAraujo, EMDasgupta, BNair, JSJanakiraman, SKRachamreddy, CRMettu, MRKaruppiah, AMReddy, BSNagalakshmi, PBora, ROMaheshwarappa, SHKumaravel, SMullick, DSistla, R Substituted 4,5,6,7-tetrahydropyrazolo[1,5-A]pyrazine derivatives as casein kinase 1 D/E inhibitors US Patent  US9598423 Publication Date 3/21/2017 
Target
Name:
Casein kinase I isoform epsilon
Synonyms:
Axin-1/Casein kinase I epsilon CKIe Casein kinase 1 epsilon (CK1Ɛ) Casein kinase I isoform epsilon (CK1 epsilon) Casein kinase I isoform epsilon (CK1epsilon) | KC1E_HUMAN
Type:
Protein
Mol. Mass.:
47340.25
Organism:
Homo sapiens (Human)
Description:
P49674
Residue:
416
  
Inhibitor
Name:
BDBM302691
Synonyms:
US9598423, Example 259
Type:
Small organic molecule
Emp. Form.:
C21H15Cl2FN6O2
Mol. Mass.:
473.287
SMILES:
NC(=O)c1c2CN(CCn2nc1-c1cc(Cl)c(F)c(Cl)c1)C(=O)Nc1ccc(cc1)[N+]#[C-]
: