Target
Casein kinase I isoform delta
Ligand
BDBM302820
Substrate
Meas. Tech.
Kinase Assay
IC50
<10±n/a nM
Citation
 Velaparthi, UDarne, CPLiu, PWittman, MDPearce, BCAraujo, EMDasgupta, BNair, JSJanakiraman, SKRachamreddy, CRMettu, MRKaruppiah, AMReddy, BSNagalakshmi, PBora, ROMaheshwarappa, SHKumaravel, SMullick, DSistla, R Substituted 4,5,6,7-tetrahydropyrazolo[1,5-A]pyrazine derivatives as casein kinase 1 D/E inhibitors US Patent  US9598423 Publication Date 3/21/2017 
Target
Name:
Casein kinase I isoform delta
Synonyms:
CKI-delta CSNK1D Casein kinase I delta Casein kinase I isoform delta (CK1D) KC1D_HUMAN | casein kinases 1 delta (CK1 delta)
Type:
Enzyme
Mol. Mass.:
47356.76
Organism:
Homo sapiens (Human)
Description:
P48730
Residue:
415
  
Inhibitor
Name:
BDBM302820
Synonyms:
2-(3-Chloro-4-fluorophenyl)- N5-(4-cyano-3- cyclopropylphenyl)-6,7- dihydropyrazolo[1,5-a] pyrazine-3,5(4H)- dicarboxamide | US9598423, Example A50
Type:
Small organic molecule
Emp. Form.:
C24H20ClFN6O2
Mol. Mass.:
478.906
SMILES:
NC(=O)c1c2CN(CCn2nc1-c1ccc(F)c(Cl)c1)C(=O)Nc1ccc(C#N)c(c1)C1CC1
: