Target
Tyrosine-protein kinase JAK1 [861-1152]
Ligand
BDBM173985
Substrate
Meas. Tech.
JAK1 Kinase Assay
IC50
20±n/a nM
Citation
 Brasca, MGBindi, SCaldarelli, MNesi, MOrrenius, SCPanzeri, A Substituted pyrroles active as kinases inhibitors US Patent  US9688661 Publication Date 6/27/2017 
Target
Name:
Tyrosine-protein kinase JAK1 [861-1152]
Synonyms:
JAK1 JAK1B Tyrosine-protein kinase JAK1 (JAK1)
Type:
Protein
Mol. Mass.:
33439.94
Organism:
Homo sapiens (Human)
Description:
Human JAK1 variant (861-1152 aa)
Residue:
292
  
Inhibitor
Name:
BDBM173985
Synonyms:
US9688661, 2-(5-Chloro-2-methylphenyl)-5-(7H-pyrrolo[2,3-d]pyrimidin-4-yl)-1H-pyrrole-3-carboxamide (compd 191)
Type:
Small organic molecule
Emp. Form.:
C18H13ClN5O
Mol. Mass.:
350.782
SMILES:
Cc1ccc(Cl)cc1-c1nc(cc1C(N)=O)-c1ncnc2[nH]ccc12
: