Target
Tyrosine-protein kinase JAK2
Ligand
BDBM174025
Substrate
Meas. Tech.
JAK2 Kinase Assay
IC50
18±n/a nM
Citation
 Brasca, MGBindi, SCaldarelli, MNesi, MOrrenius, SCPanzeri, A Substituted pyrroles active as kinases inhibitors US Patent  US9688661 Publication Date 6/27/2017 
Target
Name:
Tyrosine-protein kinase JAK2
Synonyms:
JAK-2 JAK2_HUMAN Janus kinase 2 (JAK2) | Janus kinase 2 (a protein tyrosine kinase)
Type:
Protein
Mol. Mass.:
130684.68
Organism:
Homo sapiens (Human)
Description:
O60674
Residue:
1132
  
Inhibitor
Name:
BDBM174025
Synonyms:
US9688661, 1-[2-Chloro-5-(trifluoromethyl)phenyl]-4-(1H-pyrazolo[3,4-d]pyrimidin-4-yl)-1H-pyrrole-2-carboxamide (compd 246)
Type:
Small organic molecule
Emp. Form.:
C17H11ClF3N6O
Mol. Mass.:
407.757
SMILES:
NC(=O)c1cn(cn1-c1cc(ccc1Cl)C(F)(F)F)-c1ncnc2C=NCc12
: