Target
Tyrosine-protein kinase JAK2
Ligand
BDBM174027
Substrate
Meas. Tech.
JAK2 Kinase Assay
IC50
6.00±n/a nM
Citation
 Brasca, MGBindi, SCaldarelli, MNesi, MOrrenius, SCPanzeri, A Substituted pyrroles active as kinases inhibitors US Patent  US9688661 Publication Date 6/27/2017 
Target
Name:
Tyrosine-protein kinase JAK2
Synonyms:
JAK-2 JAK2_HUMAN Janus kinase 2 (JAK2) | Janus kinase 2 (a protein tyrosine kinase)
Type:
Protein
Mol. Mass.:
130684.68
Organism:
Homo sapiens (Human)
Description:
O60674
Residue:
1132
  
Inhibitor
Name:
BDBM174027
Synonyms:
US9688661, 4-(6-Aminopyrimidin-4-yl)-1-[2-ethyl-5-(trifluoromethyl)phenyl]-1H-pyrrole-2-carboxamide (compd 256)
Type:
Small organic molecule
Emp. Form.:
C18H16F3N5O
Mol. Mass.:
375.3477
SMILES:
CCc1ccc(cc1-c1cn(cc1C(N)=O)-c1cc(N)ncn1)C(F)(F)F
: