Target
Interleukin-1 receptor-associated kinase 4
Ligand
BDBM302869
Substrate
Meas. Tech.
Kinase Activity Assay
IC50
4.60±n/a nM
Citation
 Seganish, WMMcElroy, WTBrumfield, SHerr, RJYet, LYang, JHarding, III, JPHo, GDTulshian, DYu, WWong, MKLavey, BKozlowski, JA Inhibitors of IRAK4 activity US Patent  US9598440 Publication Date 3/21/2017 
Target
Name:
Interleukin-1 receptor-associated kinase 4
Synonyms:
IRAK-4 IRAK4_HUMAN Interleukin-1 receptor-associated kinase 4 (IRAK4) | Renal carcinoma antigen NY-REN-64
Type:
Protein
Mol. Mass.:
51519.08
Organism:
Homo sapiens (Human)
Description:
Q9NWZ3
Residue:
460
  
Inhibitor
Name:
BDBM302869
Synonyms:
US9598440, 7
Type:
Small organic molecule
Emp. Form.:
C23H24N6O4S
Mol. Mass.:
480.539
SMILES:
COc1cc(Nc2ncc(-c3nc4ccccc4s3)c(N[C@@H]3C[C@H](CO)[C@@H](O)[C@H]3O)n2)ccn1
: