Target
Interleukin-1 receptor-associated kinase 4
Ligand
BDBM302951
Substrate
Meas. Tech.
Kinase Activity Assay
IC50
48.0±n/a nM
Citation
 Seganish, WMMcElroy, WTBrumfield, SHerr, RJYet, LYang, JHarding, III, JPHo, GDTulshian, DYu, WWong, MKLavey, BKozlowski, JA Inhibitors of IRAK4 activity US Patent  US9598440 Publication Date 3/21/2017 
Target
Name:
Interleukin-1 receptor-associated kinase 4
Synonyms:
IRAK-4 IRAK4_HUMAN Interleukin-1 receptor-associated kinase 4 (IRAK4) | Renal carcinoma antigen NY-REN-64
Type:
Protein
Mol. Mass.:
51519.08
Organism:
Homo sapiens (Human)
Description:
Q9NWZ3
Residue:
460
  
Inhibitor
Name:
BDBM302951
Synonyms:
US9598440, 89
Type:
Small organic molecule
Emp. Form.:
C26H37N7O3S
Mol. Mass.:
527.682
SMILES:
CN1CCN(CCCNc2nc(C)c(-c3nc4ccccc4s3)c(N[C@@H]3C[C@H](CO)[C@@H](O)[C@H]3O)n2)CC1
: