Target
Interleukin-1 receptor-associated kinase 4
Ligand
BDBM302968
Substrate
Meas. Tech.
Kinase Activity Assay
IC50
8.00±n/a nM
Citation
 Seganish, WMMcElroy, WTBrumfield, SHerr, RJYet, LYang, JHarding, III, JPHo, GDTulshian, DYu, WWong, MKLavey, BKozlowski, JA Inhibitors of IRAK4 activity US Patent  US9598440 Publication Date 3/21/2017 
Target
Name:
Interleukin-1 receptor-associated kinase 4
Synonyms:
IRAK-4 IRAK4_HUMAN Interleukin-1 receptor-associated kinase 4 (IRAK4) | Renal carcinoma antigen NY-REN-64
Type:
Protein
Mol. Mass.:
51519.08
Organism:
Homo sapiens (Human)
Description:
Q9NWZ3
Residue:
460
  
Inhibitor
Name:
BDBM302968
Synonyms:
US9598440, 107
Type:
Small organic molecule
Emp. Form.:
C27H33N6O3S
Mol. Mass.:
521.654
SMILES:
Cc1cc(Nc2nc(C)c(-c3nc4ccccc4s3)c(N[C@@H]3C[C@@H]([C@@H](O)[C@H]3O)C(C)(C)O)[nH+]2)cc(C)n1
: