Target
Interleukin-1 receptor-associated kinase 4
Ligand
BDBM302979
Substrate
Meas. Tech.
Kinase Activity Assay
IC50
10.00±n/a nM
Citation
 Seganish, WMMcElroy, WTBrumfield, SHerr, RJYet, LYang, JHarding, III, JPHo, GDTulshian, DYu, WWong, MKLavey, BKozlowski, JA Inhibitors of IRAK4 activity US Patent  US9598440 Publication Date 3/21/2017 
Target
Name:
Interleukin-1 receptor-associated kinase 4
Synonyms:
IRAK-4 IRAK4_HUMAN Interleukin-1 receptor-associated kinase 4 (IRAK4) | Renal carcinoma antigen NY-REN-64
Type:
Protein
Mol. Mass.:
51519.08
Organism:
Homo sapiens (Human)
Description:
Q9NWZ3
Residue:
460
  
Inhibitor
Name:
BDBM302979
Synonyms:
US9598440, 120
Type:
Small organic molecule
Emp. Form.:
C25H26F3N6O3S
Mol. Mass.:
547.572
SMILES:
CC(C)(O)[C@H]1C[C@@H](Nc2[nH+]c(Nc3ccnc(c3)C(F)(F)F)ncc2-c2nc3ccccc3s2)[C@H](O)[C@@H]1O
: