Target
Interleukin-1 receptor-associated kinase 4
Ligand
BDBM50107855
Substrate
Meas. Tech.
Kinase Activity Assay
IC50
204±n/a nM
Citation
 Seganish, WMMcElroy, WTBrumfield, SHerr, RJYet, LYang, JHarding, III, JPHo, GDTulshian, DYu, WWong, MKLavey, BKozlowski, JA Inhibitors of IRAK4 activity US Patent  US9598440 Publication Date 3/21/2017 
Target
Name:
Interleukin-1 receptor-associated kinase 4
Synonyms:
IRAK-4 IRAK4_HUMAN Interleukin-1 receptor-associated kinase 4 (IRAK4) | Renal carcinoma antigen NY-REN-64
Type:
Protein
Mol. Mass.:
51519.08
Organism:
Homo sapiens (Human)
Description:
Q9NWZ3
Residue:
460
  
Inhibitor
Name:
BDBM50107855
Synonyms:
CHEMBL3601194 | US9598440, 153
Type:
Small organic molecule
Emp. Form.:
C22H26N4O3S
Mol. Mass.:
426.532
SMILES:
OC[C@H]1C[C@@H](Nc2cc(NC3CCC3)ncc2-c2nc3ccccc3s2)[C@H](O)[C@@H]1O
: