Target
Nociceptin receptor
Ligand
BDBM303061
Substrate
Meas. Tech.
In Vitro ORL-1 Receptor Binding Assay
Ki
48.1±4.4 nM
Citation
 Tadesse, DTafesse, LZhou, X Phosphorus-substituted quinoxaline-type piperidine compounds and uses thereof US Patent  US9598447 Publication Date 3/21/2017 
Target
Name:
Nociceptin receptor
Synonyms:
KOR-3 Mu-type opioid receptor (Mu) Nociceptin Receptor (ORL1 Receptor) Nociceptin receptor (ORL-1) Nociceptin/Orphanin FQ, NOP receptor OPIATE ORL-1 OPRL1 protein ORL1 Opioid receptor like-1 Orphanin FQ receptor (ORL1) | P41146
Type:
G Protein-Coupled Receptor (GPCR)
Mol. Mass.:
40702.87
Organism:
Homo sapiens (Human)
Description:
P41146
Residue:
370
  
Inhibitor
Name:
BDBM303061
Synonyms:
US9598447, Ref No. AA
Type:
Small organic molecule
Emp. Form.:
C28H38N3O4P
Mol. Mass.:
511.5928
SMILES:
CCOP(=O)(OCC)c1nc2ccccc2n([C@@H]2C[C@@H]3CC[C@H](C2)N3C23CC4CC2CC(C3)C4)c1=O
: