Target
Kappa-type opioid receptor
Ligand
BDBM303066
Substrate
Meas. Tech.
In Vitro Kappa-Opioid Receptor Binding Assay
Ki
7406±609 nM
Citation
 Tadesse, DTafesse, LZhou, X Phosphorus-substituted quinoxaline-type piperidine compounds and uses thereof US Patent  US9598447 Publication Date 3/21/2017 
Target
Name:
Kappa-type opioid receptor
Synonyms:
K-OR-1 Kappa-opioid receptor (KOR) Kappa-type opioid receptor (KOR) OPIATE Kappa OPRK1 kappa opioid receptor (KOR)
Type:
G Protein-Coupled Receptor (GPCR)
Mol. Mass.:
42648.76
Organism:
Homo sapiens (Human)
Description:
P41145
Residue:
380
  
Inhibitor
Name:
BDBM303066
Synonyms:
US9598447, Ref No. KK
Type:
Small organic molecule
Emp. Form.:
C25H35N4O5P
Mol. Mass.:
502.543
SMILES:
OP(O)(=O)NC(=O)c1nc2ccccc2n([C@@H]2C[C@@H]3CCC[C@H](C2)N3C2CCCCCCC2)c1=O
: