Target
Nociceptin receptor
Ligand
BDBM303068
Substrate
Meas. Tech.
In Vitro ORL-1 Receptor Binding Assay
Ki
2.92±0.41 nM
Citation
 Tadesse, DTafesse, LZhou, X Phosphorus-substituted quinoxaline-type piperidine compounds and uses thereof US Patent  US9598447 Publication Date 3/21/2017 
Target
Name:
Nociceptin receptor
Synonyms:
KOR-3 Mu-type opioid receptor (Mu) Nociceptin Receptor (ORL1 Receptor) Nociceptin receptor (ORL-1) Nociceptin/Orphanin FQ, NOP receptor OPIATE ORL-1 OPRL1 protein ORL1 Opioid receptor like-1 Orphanin FQ receptor (ORL1) | P41146
Type:
G Protein-Coupled Receptor (GPCR)
Mol. Mass.:
40702.87
Organism:
Homo sapiens (Human)
Description:
P41146
Residue:
370
  
Inhibitor
Name:
BDBM303068
Synonyms:
US9598447, Ref No. OO
Type:
Small organic molecule
Emp. Form.:
C28H41N4O4P
Mol. Mass.:
528.6233
SMILES:
C[C@H]1C[C@H]2C[C@@H](C1)C[C@@H](C2)N1[C@H]2CCC[C@@H]1C[C@@H](C2)n1c2ccccc2nc(NCCP(O)(O)=O)c1=O
: