Target
Cyclin-dependent kinase 2/G1/S-specific cyclin-E1
Ligand
BDBM8070
Substrate
Histone H1
Meas. Tech.
CDK Inhibition Assay
pH
7.4±n/a
Temperature
303.15±n/a K
Ki
50±n/a nM
Citation
 Wang, SWood, GMeades, CGriffiths, GMidgley, CMcNae, IMcInnes, CAnderson, SJackson, WMezna, MYuill, RWalkinshaw, MFischer, PM Synthesis and biological activity of 2-anilino-4-(1H-pyrrol-3-yl) pyrimidine CDK inhibitors. Bioorg Med Chem Lett 14:4237-40 (2004)  
Target
Name:
Cyclin-dependent kinase 2/G1/S-specific cyclin-E1
Synonyms:
CDK2/CycE CDK2/E Cyclin-Dependent Kinase 2 (CDK2) Cyclin-dependent kinase 2/cyclin E1
Type:
Protein
Mol. Mass.:
Description:
Components:
This complex has 2 components.
Component 1
Name:
Cyclin-dependent kinase 2
Synonyms:
CDK2 CDK2_HUMAN Cell division protein kinase 2 Protein cereblon/Cyclin-dependent kinase 2 | p33 protein kinase
Type:
Enzyme Subunit
Mol. Mass.:
33938.17
Organism:
Homo sapiens (Human)
Description:
P24941
Residue:
298
  
Component 2
Name:
G1/S-specific cyclin-E1
Synonyms:
CCNE CCNE1_HUMAN
Type:
Enzyme Subunit
Mol. Mass.:
47073.17
Organism:
Homo sapiens (Human)
Description:
Residue:
410
  
Inhibitor
Name:
BDBM8070
Synonyms:
2-anilino-4-(1H-pyrrol-3-yl) pyrimidine deriv. 8a | 4-(2,4-dimethyl-1H-pyrrol-3-yl)-N-(3-nitrophenyl)pyrimidin-2-amine
Type:
Small organic molecule
Emp. Form.:
C16H15N5O2
Mol. Mass.:
309.3226
SMILES:
Cc1c[nH]c(C)c1-c1ccnc(Nc2cccc(c2)N(=O)=O)n1
:
Substrate
Name:
Histone H1
Synonyms:
Type:
Other Protein Type
Mol. Mass.:
358.43
Organism:
Bos taurus (bovine)
Description:
Residue:
3
NA