Target
Isocitrate dehydrogenase [NADP] cytoplasmic [R132H]
Ligand
BDBM303080
Substrate
Meas. Tech.
Mutant IDH1 Cellular Assay
IC50
600±n/a nM
Citation
 Rehwinkel, HAnlauf, SNguyen, DPanknin, OBauser, MZimmermann, KKaulfuss, SNeuhaus, RBlaney, PMToschi, G 1-cyclohexyl-2-phenylaminobenzimidazoles as mIDH1 inhibitors for the treatment of tumors US Patent  US10137110 Publication Date 11/27/2018 
Target
Name:
Isocitrate dehydrogenase [NADP] cytoplasmic [R132H]
Synonyms:
Cytosolic NADP-isocitrate dehydrogenase (IDH1)(R132H) IDH1 R132H IDHC_HUMAN Isocitrate dehydrogenase 1 mutant (R132H) Isocitrate dehydrogenase [NADP] cytoplasmic (IDH1)(R132H) PICD
Type:
Protein
Mol. Mass.:
46641.74
Organism:
Homo sapiens (Human)
Description:
Human IDH1 R132H (SEQ ID No. 2 in patent). First three are removed. Google patent parsed wrong.
Residue:
414
  
Inhibitor
Name:
BDBM303080
Synonyms:
US10137110, Example 2-4
Type:
Small organic molecule
Emp. Form.:
C26H28F3N5O
Mol. Mass.:
483.5286
SMILES:
C[C@H]1C[C@H](CC(C)(C)C1)n1c(Nc2ccc(OC(F)(F)F)cc2)nc2cc(ccc12)-c1cn[nH]c1
: