Target
Casein kinase I isoform delta
Ligand
BDBM188507
Substrate
Kd
<100±n/a nM
Citation
 Wagner, FFPan, JQDandapani, SGermain, AHolson, EMunoz, BNag, PPLewis, MCHaggarty, SJBishop, JAStegmaier, KWeiwer, MBanerji, V Kinase inhibitors and methods of use thereof US Patent  US10137122 Publication Date 11/27/2018 
Target
Name:
Casein kinase I isoform delta
Synonyms:
CKI-delta CSNK1D Casein kinase I delta Casein kinase I isoform delta (CK1D) KC1D_HUMAN | casein kinases 1 delta (CK1 delta)
Type:
Enzyme
Mol. Mass.:
47356.76
Organism:
Homo sapiens (Human)
Description:
P48730
Residue:
415
  
Inhibitor
Name:
BDBM188507
Synonyms:
4-(4-fluorophenyl)-3,7,7-trimethyl-2,4,6,7,8,9-hexahydro-5H-pyrazolo[3,4-b]quinolin-5-one (10) | US10137122, Compound 12
Type:
Small organic molecule
Emp. Form.:
C19H20FN3O
Mol. Mass.:
325.38
SMILES:
Cc1[nH]nc2NC3=C(C(c12)c1ccc(F)cc1)C(=O)CC(C)(C)C3
: