Target
Prolyl endopeptidase FAP
Ligand
BDBM303139
Substrate
Meas. Tech.
TPI assay
IC50
1900±n/a nM
Citation
 Kontermann, RPfizenmaier, KFerrer, CFabre, MSimon, L Antibody-drug conjugates and immunotoxins US Patent  US10137202 Publication Date 11/27/2018 
Target
Name:
Prolyl endopeptidase FAP
Synonyms:
170 kDa melanoma membrane-bound gelatinase Fibroblast Activation Protein (FAP) Integral membrane serine protease Seprase
Type:
Enzyme
Mol. Mass.:
87712.48
Organism:
Homo sapiens (Human)
Description:
Q12884
Residue:
760
  
Inhibitor
Name:
BDBM303139
Synonyms:
US10137202, Compound TAM558
Type:
Small organic molecule
Emp. Form.:
C79H122N14O19S
Mol. Mass.:
1603.961
SMILES:
CCCO[C@H](C[C@H](C(C)C)N(CCC)C(=O)[C@@H](NC(=O)[C@H]1CCCCN1C)[C@@H](C)CC)c1nc(cs1)C(=O)N[C@H](C[C@H](C)C(=O)NNC(=O)OCCOCCOCCOCCNC(=O)OCc1ccc(NC(=O)[C@H](CCCNC(N)=O)NC(=O)[C@@H](NC(=O)CCCCCN2C(=O)C=CC2=O)C(C)C)cc1)Cc1ccc(O)cc1
: