Target
Cytochrome P450 2D6
Ligand
BDBM188461
Substrate
BDBM213826
Meas. Tech.
Drug-Drug Interaction (DDI) Assay
pH
7.4±n/a
IC50
2000±0.0 nM
Comments
extracted
Citation
 Keith, JMLiu, J Modulators of fatty acid amide hydrolase US Patent  US9688664 Publication Date 6/27/2017 
Target
Name:
Cytochrome P450 2D6
Synonyms:
CP2D6_HUMAN CYP2DL1 Cytochrome P450 2D6 (CYP2D6) P450-DB1
Type:
Protein
Mol. Mass.:
55774.82
Organism:
Homo sapiens (Human)
Description:
P10635
Residue:
497
  
Inhibitor
Name:
BDBM188461
Synonyms:
US9169224, 150 | US9688664, Comparator Compound
Type:
Small organic molecule
Emp. Form.:
C18H18F2N4O3
Mol. Mass.:
376.3573
SMILES:
FC1(F)Oc2ccc(CN3CCN(CC3)C(=O)Nc3cccnc3)cc2O1
:
Substrate
Name:
BDBM213826
Synonyms:
Dextromethorphan | US11535596, Compound Dextromethorphan (DM)
Type:
Small organic molecule
Emp. Form.:
C18H25NO
Mol. Mass.:
271.3972
SMILES:
COc1ccc2C[C@@H]3[C@H]4CCCC[C@]4(CCN3C)c2c1
: