Target
Amyloid-beta precursor protein
Ligand
BDBM303148
Substrate
Meas. Tech.
Radiolabeling of ThT and Radioligand Binding Assay
Ki
5.70±n/a nM
Citation
 Klunk, WEMathis, Jr., CAWang, Y Thioflavin derivatives for use in antemortem diagnosis of Alzheimer's disease and in vivo imaging and prevention of amyloid deposition US Patent  US10137210 Publication Date 11/27/2018 
Target
Name:
Amyloid-beta precursor protein
Synonyms:
A4 ABPP AICD-50 AICD-59 AID(57) APP Alzheimer disease amyloid protein Amyloid beta Protein Amyloid beta protein Abeta(1-42) Amyloid intracellular domain 57 Amyloid protein (Abeta42b) Beta amyloid A4 protein Beta-APP42 Beta-amyloid protein 42 C83 CVAP Gamma Secretase Gamma-CTF(57) Gamma-secretase Gamma-secretase C-terminal fragment 57 P3(40) PN-II Protease nexin-II S-APP-beta Soluble APP-beta | beta-Amyloid Precursor Protein (APP)
Type:
Single-pass type I membrane protein
Mol. Mass.:
86890.41
Organism:
Homo sapiens (Human)
Description:
P05067
Residue:
770
  
Inhibitor
Name:
BDBM303148
Synonyms:
US10137210, Example [N-methyl-11C]6-MeO-BTA-1
Type:
Small organic molecule
Emp. Form.:
C15H14N2OS
Mol. Mass.:
270.349
SMILES:
CNc1ccc(cc1)-c1nc2ccc(CO)cc2s1
: