Target
Adenosine receptor A2a
Ligand
BDBM303308
Substrate
Meas. Tech.
A2a Ki assay
Ki
3.60±n/a nM
Citation
 Ali, AKuang, RLim, YLo, MMTing, PCBiju, Pde Lera Ruiz, MDegrado, SJTung, ALHenderson, TJHong, LKim, JKim, DWLee, JWu, JWu, HXiao, YYu, TZhou, GZhu, XMcCormick, KDTagat, JRXiao, DKhan, TCao, JBerlin, MZhang, Y Aminoquinazoline compounds as A2A antagonist US Patent  US10138212 Publication Date 11/27/2018 
Target
Name:
Adenosine receptor A2a
Synonyms:
A2A adenosine receptor (hA2A) ADENOSINE A2 ADORA2 Adenosine A2A receptor (A2AAR)
Type:
G Protein-Coupled Receptor (GPCR)
Mol. Mass.:
44716.46
Organism:
Homo sapiens (Human)
Description:
P29274
Residue:
412
  
Inhibitor
Name:
BDBM303308
Synonyms:
2-amino-N-[[6- (difluoromethyl)-2- pyridyl]methyl]-8-fluoro- quinazoline-4- carboxamide | US10138212, Example 71
Type:
Small organic molecule
Emp. Form.:
C16H12F3N5O
Mol. Mass.:
347.2946
SMILES:
Nc1nc(C(=O)NCc2cccc(n2)C(F)F)c2cccc(F)c2n1
: