Target
Adenosine receptor A2a
Ligand
BDBM303320
Substrate
Meas. Tech.
A2a Ki assay
Ki
14.0±n/a nM
Citation
 Ali, AKuang, RLim, YLo, MMTing, PCBiju, Pde Lera Ruiz, MDegrado, SJTung, ALHenderson, TJHong, LKim, JKim, DWLee, JWu, JWu, HXiao, YYu, TZhou, GZhu, XMcCormick, KDTagat, JRXiao, DKhan, TCao, JBerlin, MZhang, Y Aminoquinazoline compounds as A2A antagonist US Patent  US10138212 Publication Date 11/27/2018 
Target
Name:
Adenosine receptor A2a
Synonyms:
A2A adenosine receptor (hA2A) ADENOSINE A2 ADORA2 Adenosine A2A receptor (A2AAR)
Type:
G Protein-Coupled Receptor (GPCR)
Mol. Mass.:
44716.46
Organism:
Homo sapiens (Human)
Description:
P29274
Residue:
412
  
Inhibitor
Name:
BDBM303320
Synonyms:
2-amino-N-[(5- cyclopropylisoxazol-3- yl)methyl]-8-fluoro- quinazoline-4- carboxamide | US10138212, Example 83
Type:
Small organic molecule
Emp. Form.:
C16H14FN5O2
Mol. Mass.:
327.3131
SMILES:
Nc1nc(C(=O)NCc2cc(on2)C2CC2)c2cccc(F)c2n1
: