Target
Adenosine receptor A2a
Ligand
BDBM303344
Substrate
Meas. Tech.
A2a Ki assay
Ki
1.90±n/a nM
Citation
 Ali, AKuang, RLim, YLo, MMTing, PCBiju, Pde Lera Ruiz, MDegrado, SJTung, ALHenderson, TJHong, LKim, JKim, DWLee, JWu, JWu, HXiao, YYu, TZhou, GZhu, XMcCormick, KDTagat, JRXiao, DKhan, TCao, JBerlin, MZhang, Y Aminoquinazoline compounds as A2A antagonist US Patent  US10138212 Publication Date 11/27/2018 
Target
Name:
Adenosine receptor A2a
Synonyms:
A2A adenosine receptor (hA2A) ADENOSINE A2 ADORA2 Adenosine A2A receptor (A2AAR)
Type:
G Protein-Coupled Receptor (GPCR)
Mol. Mass.:
44716.46
Organism:
Homo sapiens (Human)
Description:
P29274
Residue:
412
  
Inhibitor
Name:
BDBM303344
Synonyms:
2-amino-N-[dideuterio- [6-[dideuterio-[3-(2- methoxyethoxy)phenyl] methyl]-2- pyridyl]methyl]-8- methoxy-quinazoline- 4-carboxamide | US10138212, Example 106
Type:
Small organic molecule
Emp. Form.:
C26H27N5O4
Mol. Mass.:
477.5483
SMILES:
[2H]C([2H])(NC(=O)c1nc(N)nc2c(OC)cccc12)c1cccc(n1)C([2H])([2H])c1cccc(OCCOC)c1
: