Target
Receptor-interacting serine/threonine-protein kinase 2
Ligand
BDBM303247
Substrate
Meas. Tech.
V9103X ADP-Glo Kinase Assay Custom
IC50
94.0±n/a nM
Citation
 Cui, JGao, DALiu, PMcKibben, BPMiller, CARazavi, HSpencer, ERuppel, SPadyana, AK Substituted benzamides as RIPK2 inhibitors US Patent  US10138222 Publication Date 11/27/2018 
Target
Name:
Receptor-interacting serine/threonine-protein kinase 2
Synonyms:
CARDIAK RIP2 RIPK2_HUMAN Tyrosine-protein kinase RIPK2 | receptor-interacting serine/threonine-protein kinase 2
Type:
Protein
Mol. Mass.:
61201.30
Organism:
Homo sapiens (Human)
Description:
Residue:
540
  
Inhibitor
Name:
BDBM303247
Synonyms:
US10138222, Example 31
Type:
Small organic molecule
Emp. Form.:
C18H15ClN4O
Mol. Mass.:
338.791
SMILES:
Clc1ccc(cc1-c1cnn(c1)-c1cccnc1)C(=O)NC1CC1
: