Target
Receptor-interacting serine/threonine-protein kinase 2
Ligand
BDBM303379
Substrate
Meas. Tech.
V9103X ADP-Glo Kinase Assay Custom
IC50
1.90±n/a nM
Citation
 Cui, JGao, DALiu, PMcKibben, BPMiller, CARazavi, HSpencer, ERuppel, SPadyana, AK Substituted benzamides as RIPK2 inhibitors US Patent  US10138222 Publication Date 11/27/2018 
Target
Name:
Receptor-interacting serine/threonine-protein kinase 2
Synonyms:
CARDIAK RIP2 RIPK2_HUMAN Tyrosine-protein kinase RIPK2 | receptor-interacting serine/threonine-protein kinase 2
Type:
Protein
Mol. Mass.:
61201.30
Organism:
Homo sapiens (Human)
Description:
Residue:
540
  
Inhibitor
Name:
BDBM303379
Synonyms:
US10138222, Example 104
Type:
Small organic molecule
Emp. Form.:
C21H18ClFN4O
Mol. Mass.:
396.845
SMILES:
Fc1cc(Cl)c(cc1C(=O)NC1CC1)-c1cnn(c1)-c1cncc(c1)C1CC1
: