Target
Receptor-interacting serine/threonine-protein kinase 2
Ligand
BDBM303382
Substrate
Meas. Tech.
V9103X ADP-Glo Kinase Assay Custom
IC50
3.30±n/a nM
Citation
 Cui, JGao, DALiu, PMcKibben, BPMiller, CARazavi, HSpencer, ERuppel, SPadyana, AK Substituted benzamides as RIPK2 inhibitors US Patent  US10138222 Publication Date 11/27/2018 
Target
Name:
Receptor-interacting serine/threonine-protein kinase 2
Synonyms:
CARDIAK RIP2 RIPK2_HUMAN Tyrosine-protein kinase RIPK2 | receptor-interacting serine/threonine-protein kinase 2
Type:
Protein
Mol. Mass.:
61201.30
Organism:
Homo sapiens (Human)
Description:
Residue:
540
  
Inhibitor
Name:
BDBM303382
Synonyms:
US10138222, Example 107
Type:
Small organic molecule
Emp. Form.:
C21H22N6O2
Mol. Mass.:
390.4384
SMILES:
CNC(=O)Nc1cncc(c1)-n1cc(cn1)-c1cc(ccc1C)C(=O)NC1CC1
: