Target
Receptor-interacting serine/threonine-protein kinase 2
Ligand
BDBM303391
Substrate
Meas. Tech.
V9103X ADP-Glo Kinase Assay Custom
IC50
2.70±n/a nM
Citation
 Cui, JGao, DALiu, PMcKibben, BPMiller, CARazavi, HSpencer, ERuppel, SPadyana, AK Substituted benzamides as RIPK2 inhibitors US Patent  US10138222 Publication Date 11/27/2018 
Target
Name:
Receptor-interacting serine/threonine-protein kinase 2
Synonyms:
CARDIAK RIP2 RIPK2_HUMAN Tyrosine-protein kinase RIPK2 | receptor-interacting serine/threonine-protein kinase 2
Type:
Protein
Mol. Mass.:
61201.30
Organism:
Homo sapiens (Human)
Description:
Residue:
540
  
Inhibitor
Name:
BDBM303391
Synonyms:
US10138222, Example 115
Type:
Small organic molecule
Emp. Form.:
C24H25N5O2
Mol. Mass.:
415.4876
SMILES:
Cc1ccc(cc1-c1cnn(c1)-c1cncc(NC(=O)C2CCC2)c1)C(=O)NC1CC1
: