Target
Cyclin-A2/Cyclin-dependent kinase 2
Ligand
BDBM8182
Substrate
Biotinylated peptide substrate
Meas. Tech.
Kinase Inhibition SPA Assay
IC50
>19950±n/a nM
Citation
 Tavares, FXBoucheron, JADickerson, SHGriffin, RJPreugschat, FThomson, SAWang, TYZhou, HQ N-Phenyl-4-pyrazolo[1,5-b]pyridazin-3-ylpyrimidin-2-amines as potent and selective inhibitors of glycogen synthase kinase 3 with good cellular efficacy. J Med Chem 47:4716-30 (2004)  
Target
Name:
Cyclin-A2/Cyclin-dependent kinase 2
Synonyms:
CDK2-CyclinA CDK2/Cyclin A Cyclin A2/dependent kinase 2 Cyclin-Dependent Kinase 2 (CDK2A)
Type:
Protein Complex
Mol. Mass.:
Description:
Cdk2/Cyclin A kinase was purified from insect cells coinfected with Cyclin A/Cdk2 baculovirus.
Components:
This complex has 2 components.
Component 1
Name:
Cyclin-dependent kinase 2
Synonyms:
CDK2 CDK2_HUMAN Cell division protein kinase 2 Protein cereblon/Cyclin-dependent kinase 2 | p33 protein kinase
Type:
Enzyme Subunit
Mol. Mass.:
33938.17
Organism:
Homo sapiens (Human)
Description:
P24941
Residue:
298
  
Component 2
Name:
Cyclin-A2
Synonyms:
CCN1 CCNA1 CCNA2_HUMAN Cyclin-A
Type:
Enzyme Subunit
Mol. Mass.:
48550.19
Organism:
Homo sapiens (Human)
Description:
P20248
Residue:
432
  
Inhibitor
Name:
BDBM8182
Synonyms:
N-Phenyl-4-{2-[4-(trifluoromethyl)phenyl]pyrazolo-[1,5-b]pyridazin-3-yl}pyrimidin-2-amine pyrazolo[1,5-b]pyridazine deriv. 73
Type:
Small organic molecule
Emp. Form.:
C23H15F3N6
Mol. Mass.:
432.4006
SMILES:
FC(F)(F)c1ccc(cc1)-c1nn2ncccc2c1-c1ccnc(Nc2ccccc2)n1
:
Substrate
Name:
Biotinylated Peptide Substrate
Synonyms:
Type:
Peptide
Mol. Mass.:
6828.27
Organism:
Description:
Residue:
63