Target
Isocitrate dehydrogenase [NADP] cytoplasmic [R132H]
Ligand
BDBM303484
Substrate
Meas. Tech.
Mutant IDH1 R132H Biochemical Assay
IC50
10000±n/a nM
Citation
 Rehwinkel, HBauser, MZimmermann, KKaulfuß, SNeuhaus, R Benzimidazol-2-amines as MIDH1 inhibitors US Patent  US10138226 Publication Date 11/27/2018 
Target
Name:
Isocitrate dehydrogenase [NADP] cytoplasmic [R132H]
Synonyms:
Cytosolic NADP-isocitrate dehydrogenase (IDH1)(R132H) IDH1 R132H IDHC_HUMAN Isocitrate dehydrogenase 1 mutant (R132H) Isocitrate dehydrogenase [NADP] cytoplasmic (IDH1)(R132H) PICD
Type:
Protein
Mol. Mass.:
46641.74
Organism:
Homo sapiens (Human)
Description:
Human IDH1 R132H (SEQ ID No. 2 in patent). First three are removed. Google patent parsed wrong.
Residue:
414
  
Inhibitor
Name:
BDBM303484
Synonyms:
US10138226, Example 2-19
Type:
Small organic molecule
Emp. Form.:
C25H29F3N4O4S
Mol. Mass.:
538.582
SMILES:
C[C@H]1C[C@H](CC(C)(C)C1)n1c(Nc2ccc(OC(F)(F)F)cc2)nc2ccc(cc12)C(=O)NS(C)(=O)=O
: