Target
Isocitrate dehydrogenase [NADP] cytoplasmic [R132H]
Ligand
BDBM303493
Substrate
Meas. Tech.
Mutant IDH1 R132H Biochemical Assay
IC50
10000±n/a nM
Citation
 Rehwinkel, HBauser, MZimmermann, KKaulfuß, SNeuhaus, R Benzimidazol-2-amines as MIDH1 inhibitors US Patent  US10138226 Publication Date 11/27/2018 
Target
Name:
Isocitrate dehydrogenase [NADP] cytoplasmic [R132H]
Synonyms:
Cytosolic NADP-isocitrate dehydrogenase (IDH1)(R132H) IDH1 R132H IDHC_HUMAN Isocitrate dehydrogenase 1 mutant (R132H) Isocitrate dehydrogenase [NADP] cytoplasmic (IDH1)(R132H) PICD
Type:
Protein
Mol. Mass.:
46641.74
Organism:
Homo sapiens (Human)
Description:
Human IDH1 R132H (SEQ ID No. 2 in patent). First three are removed. Google patent parsed wrong.
Residue:
414
  
Inhibitor
Name:
BDBM303493
Synonyms:
US10138226, Example 2-24
Type:
Small organic molecule
Emp. Form.:
C30H37F3N4O4
Mol. Mass.:
574.6344
SMILES:
CCOC(=O)CCN(C)C(=O)c1ccc2nc(Nc3ccc(OC(F)(F)F)cc3)n([C@@H]3C[C@H](C)CC(C)(C)C3)c2c1
: