Target
Bile acid receptor
Ligand
BDBM303496
Substrate
Meas. Tech.
Human FXR (NR1H4) Assay
EC50
550±n/a nM
Citation
 Or, YSHe, YShen, RXing, XGranger, BWang, BMa, JHe, JLong, JWang, G Isoxazole derivatives as FXR agonists and methods of use therof US Patent  US10138228 Publication Date 11/27/2018 
Target
Name:
Bile acid receptor
Synonyms:
BAR FXR HRR1 NR1H4_HUMAN RIP14 Retinoid X receptor-interacting protein 14 | farnesoid x receptor
Type:
Nuclear Receptor
Mol. Mass.:
55916.24
Organism:
Homo sapiens (Human)
Description:
Q96RI1
Residue:
486
  
Inhibitor
Name:
BDBM303496
Synonyms:
US10138228, Example 1
Type:
Small organic molecule
Emp. Form.:
C31H27Cl2F3N4O5S
Mol. Mass.:
695.536
SMILES:
CN(Cc1ccc(cc1)C(=O)NS(=O)(=O)C1CC1)c1ccc(OCc2c(onc2-c2c(Cl)cccc2Cl)C2CC2)nc1C(F)(F)F
: