Target
Tyrosine-protein kinase BTK
Ligand
BDBM303584
Substrate
Meas. Tech.
BTK Assay
IC50
4.80±n/a nM
Citation
 Bentzien, JBerry, AKBosanac, TBurke, MJDisalvo, DTHoran, JCLiang, SMao, CMao, WShen, YSoleymanzadeh, FZindell, RM Heteroaromatic compounds as BTK inhibitors US Patent  US10138229 Publication Date 11/27/2018 
Target
Name:
Tyrosine-protein kinase BTK
Synonyms:
AGMX1 Agammaglobulinaemia tyrosine kinase B cell progenitor kinase BPK BTK_HUMAN Tyrosine Kinase BTK Tyrosine-protein kinase BTK (BTK)
Type:
Enzyme
Mol. Mass.:
76289.95
Organism:
Homo sapiens (Human)
Description:
Q06187
Residue:
659
  
Inhibitor
Name:
BDBM303584
Synonyms:
US10138229, Example 96 | US10875852, Example 96
Type:
Small organic molecule
Emp. Form.:
C24H23FN4O3
Mol. Mass.:
434.4628
SMILES:
NC(=O)c1cn(nc1-c1ccc(Oc2ccccc2F)cc1)[C@@H]1CCCN(C1)C(=O)C=C
: