Target
Tyrosine-protein kinase BTK
Ligand
BDBM303617
Substrate
Meas. Tech.
BTK Assay
IC50
29.0±n/a nM
Citation
 Bentzien, JBerry, AKBosanac, TBurke, MJDisalvo, DTHoran, JCLiang, SMao, CMao, WShen, YSoleymanzadeh, FZindell, RM Heteroaromatic compounds as BTK inhibitors US Patent  US10138229 Publication Date 11/27/2018 
Target
Name:
Tyrosine-protein kinase BTK
Synonyms:
AGMX1 Agammaglobulinaemia tyrosine kinase B cell progenitor kinase BPK BTK_HUMAN Tyrosine Kinase BTK Tyrosine-protein kinase BTK (BTK)
Type:
Enzyme
Mol. Mass.:
76289.95
Organism:
Homo sapiens (Human)
Description:
Q06187
Residue:
659
  
Inhibitor
Name:
BDBM303617
Synonyms:
US10138229, Example 129 | US10875852, Example 129
Type:
Small organic molecule
Emp. Form.:
C22H22F3N5O2
Mol. Mass.:
445.4376
SMILES:
CC#CC(=O)N1CC[C@]2(C[C@@H](C2)n2nc(c(C(N)=O)c2N)-c2ccc(cc2)C(F)(F)F)C1
: