Target
Tyrosine-protein kinase BTK
Ligand
BDBM303637
Substrate
Meas. Tech.
BTK Assay
IC50
100.0±n/a nM
Citation
 Bentzien, JBerry, AKBosanac, TBurke, MJDisalvo, DTHoran, JCLiang, SMao, CMao, WShen, YSoleymanzadeh, FZindell, RM Heteroaromatic compounds as BTK inhibitors US Patent  US10138229 Publication Date 11/27/2018 
Target
Name:
Tyrosine-protein kinase BTK
Synonyms:
AGMX1 Agammaglobulinaemia tyrosine kinase B cell progenitor kinase BPK BTK_HUMAN Tyrosine Kinase BTK Tyrosine-protein kinase BTK (BTK)
Type:
Enzyme
Mol. Mass.:
76289.95
Organism:
Homo sapiens (Human)
Description:
Q06187
Residue:
659
  
Inhibitor
Name:
BDBM303637
Synonyms:
US10138229, Example 149 | US10875852, Example 149
Type:
Small organic molecule
Emp. Form.:
C22H21F4N5O3
Mol. Mass.:
479.4275
SMILES:
CC#CC(=O)N1CC2(CC(C2)n2nc(c(C(N)=O)c2N)-c2ccc(F)c(OCC(F)(F)F)c2)C1
: