Target
Tyrosine-protein kinase BTK
Ligand
BDBM303642
Substrate
Meas. Tech.
BTK Assay
IC50
0.600±n/a nM
Citation
 Bentzien, JBerry, AKBosanac, TBurke, MJDisalvo, DTHoran, JCLiang, SMao, CMao, WShen, YSoleymanzadeh, FZindell, RM Heteroaromatic compounds as BTK inhibitors US Patent  US10138229 Publication Date 11/27/2018 
Target
Name:
Tyrosine-protein kinase BTK
Synonyms:
AGMX1 Agammaglobulinaemia tyrosine kinase B cell progenitor kinase BPK BTK_HUMAN Tyrosine Kinase BTK Tyrosine-protein kinase BTK (BTK)
Type:
Enzyme
Mol. Mass.:
76289.95
Organism:
Homo sapiens (Human)
Description:
Q06187
Residue:
659
  
Inhibitor
Name:
BDBM303642
Synonyms:
US10138229, Example 154 | US10875852, Example 154
Type:
Small organic molecule
Emp. Form.:
C22H25N5O3
Mol. Mass.:
407.4656
SMILES:
COc1ccc(cc1)-c1nn([C@H]2C[C@]3(C2)CCN(C3)C(=O)C#CC)c(N)c1C(N)=O
: