Target
Tyrosine-protein kinase BTK
Ligand
BDBM303645
Substrate
Meas. Tech.
BTK Assay
IC50
2.00±n/a nM
Citation
 Bentzien, JBerry, AKBosanac, TBurke, MJDisalvo, DTHoran, JCLiang, SMao, CMao, WShen, YSoleymanzadeh, FZindell, RM Heteroaromatic compounds as BTK inhibitors US Patent  US10138229 Publication Date 11/27/2018 
Target
Name:
Tyrosine-protein kinase BTK
Synonyms:
AGMX1 Agammaglobulinaemia tyrosine kinase B cell progenitor kinase BPK BTK_HUMAN Tyrosine Kinase BTK Tyrosine-protein kinase BTK (BTK)
Type:
Enzyme
Mol. Mass.:
76289.95
Organism:
Homo sapiens (Human)
Description:
Q06187
Residue:
659
  
Inhibitor
Name:
BDBM303645
Synonyms:
US10138229, Example 157 | US10875852, Example 157
Type:
Small organic molecule
Emp. Form.:
C24H27N5O3
Mol. Mass.:
433.5029
SMILES:
CC#CC(=O)N1CC[C@@]2(C[C@@H](C2)n2nc(c(C(N)=O)c2N)-c2ccc(OC3CC3)cc2)C1
: