Target
Tyrosine-protein kinase BTK
Ligand
BDBM303636
Substrate
Meas. Tech.
BTK Assay
IC50
6.60±n/a nM
Citation
 Bentzien, JBerry, AKBosanac, TBurke, MJDisalvo, DTHoran, JCLiang, SMao, CMao, WShen, YSoleymanzadeh, FZindell, RM Heteroaromatic compounds as BTK inhibitors US Patent  US10138229 Publication Date 11/27/2018 
Target
Name:
Tyrosine-protein kinase BTK
Synonyms:
AGMX1 Agammaglobulinaemia tyrosine kinase B cell progenitor kinase BPK BTK_HUMAN Tyrosine Kinase BTK Tyrosine-protein kinase BTK (BTK)
Type:
Enzyme
Mol. Mass.:
76289.95
Organism:
Homo sapiens (Human)
Description:
Q06187
Residue:
659
  
Inhibitor
Name:
BDBM303636
Synonyms:
BDBM303654 US10875852, Example 166
Type:
Small organic molecule
Emp. Form.:
C23H26ClN5O3
Mol. Mass.:
455.937
SMILES:
CCCOc1ccc(cc1Cl)-c1nn(C2CC3(C2)CN(C3)C(=O)C#CC)c(N)c1C(N)=O
: