Target
Ectonucleotide pyrophosphatase/phosphodiesterase family member 2
Ligand
BDBM303687
Substrate
Meas. Tech.
Quanta Red Assay
IC50
4.00±n/a nM
Citation
 Blum, FCarr, JLShah, PDel Mar Jimenez Quesada, MGutierrez, IF Autotaxin inhibitors US Patent  US10138230 Publication Date 11/27/2018 
Target
Name:
Ectonucleotide pyrophosphatase/phosphodiesterase family member 2
Synonyms:
ATX Autotaxin (ATX) ENPP2 Ectonucleotide Pyrophosphatase/Phosphodiesterase 2 (ENPP2) Extracellular lysophospholipase D PDNP2
Type:
Enzyme
Mol. Mass.:
99007.13
Organism:
Homo sapiens (Human)
Description:
Q13822
Residue:
863
  
Inhibitor
Name:
BDBM303687
Synonyms:
N-[5-[2-(4- chlorophenyl)ethyl]- 1,3,4-thiadiazol-2-yl]-1- [4-[(4-methylpiperazin-1- yl)methyl]phenyl]-5-oxo- pyrrolidine-3- carboxamide | US10138230, Example F117
Type:
Small organic molecule
Emp. Form.:
C27H31ClN6O2S
Mol. Mass.:
539.092
SMILES:
CN1CCN(Cc2ccc(cc2)N2CC(CC2=O)C(=O)Nc2nnc(CCc3ccc(Cl)cc3)s2)CC1
: