Target
Ectonucleotide pyrophosphatase/phosphodiesterase family member 2
Ligand
BDBM303690
Substrate
Meas. Tech.
Quanta Red Assay
IC50
4.00±n/a nM
Citation
 Blum, FCarr, JLShah, PDel Mar Jimenez Quesada, MGutierrez, IF Autotaxin inhibitors US Patent  US10138230 Publication Date 11/27/2018 
Target
Name:
Ectonucleotide pyrophosphatase/phosphodiesterase family member 2
Synonyms:
ATX Autotaxin (ATX) ENPP2 Ectonucleotide Pyrophosphatase/Phosphodiesterase 2 (ENPP2) Extracellular lysophospholipase D PDNP2
Type:
Enzyme
Mol. Mass.:
99007.13
Organism:
Homo sapiens (Human)
Description:
Q13822
Residue:
863
  
Inhibitor
Name:
BDBM303690
Synonyms:
N-[5-[2-(4- chlorophenyl)ethyl]- 1,3,4-thiadiazol-2-yl]-1- [4- [[ethyl(propyl)amino] methyl]phenyl]-5-oxo- pyrrolidine-3- carboxamide | US10138230, Example F120
Type:
Small organic molecule
Emp. Form.:
C27H32ClN5O2S
Mol. Mass.:
526.093
SMILES:
CCCN(CC)Cc1ccc(cc1)N1CC(CC1=O)C(=O)Nc1nnc(CCc2ccc(Cl)cc2)s1
: