Target
Sphingosine kinase 1
Ligand
BDBM174010
Substrate
Meas. Tech.
Scintillation Proximity Assay
Ki
>10000±n/a nM
Citation
 Santos, WLLynch, KRMacdonald, TLKennedy, AKharel, YRaje, MRHouck, J Long chain base sphingosine kinase inhibitors US Patent  US9688668 Publication Date 6/27/2017 
Target
Name:
Sphingosine kinase 1
Synonyms:
SK1 SPHK1 SPK Sphingosine kinase 1 (SPHK1) | Sphingosine kinase types 1 (SphK1)
Type:
Enzyme
Mol. Mass.:
42521.16
Organism:
Homo sapiens (Human)
Description:
Q9NYA1
Residue:
384
  
Inhibitor
Name:
BDBM174010
Synonyms:
US9688668, 2
Type:
Small organic molecule
Emp. Form.:
C18H37N3O
Mol. Mass.:
311.5059
SMILES:
CCCCCCCCCCCCC\C=C\[C@@H](O)[C@@H](N)C(N)=N
: