Target
Sphingosine kinase 2
Ligand
BDBM174023
Substrate
Meas. Tech.
Scintillation Proximity Assay
Ki
>10000±n/a nM
Citation
 Santos, WLLynch, KRMacdonald, TLKennedy, AKharel, YRaje, MRHouck, J Long chain base sphingosine kinase inhibitors US Patent  US9688668 Publication Date 6/27/2017 
Target
Name:
Sphingosine kinase 2
Synonyms:
SK 2 SPHK2 SPK 2 Sphingosine kinase types 2 (SphK2)
Type:
Protein
Mol. Mass.:
69221.44
Organism:
Homo sapiens (Human)
Description:
Q9NRA0
Residue:
654
  
Inhibitor
Name:
BDBM174023
Synonyms:
US9688668, 5
Type:
Small organic molecule
Emp. Form.:
C20H34N2
Mol. Mass.:
302.4974
SMILES:
CCCCCCCCCCc1ccc(CCCC(N)=N)cc1
: