Target
Sphingosine kinase 2
Ligand
BDBM174072
Substrate
Meas. Tech.
Scintillation Proximity Assay
Ki
>10000±n/a nM
Citation
 Santos, WLLynch, KRMacdonald, TLKennedy, AKharel, YRaje, MRHouck, J Long chain base sphingosine kinase inhibitors US Patent  US9688668 Publication Date 6/27/2017 
Target
Name:
Sphingosine kinase 2
Synonyms:
SK 2 SPHK2 SPK 2 Sphingosine kinase types 2 (SphK2)
Type:
Protein
Mol. Mass.:
69221.44
Organism:
Homo sapiens (Human)
Description:
Q9NRA0
Residue:
654
  
Inhibitor
Name:
BDBM174072
Synonyms:
US9688668, 36
Type:
Small organic molecule
Emp. Form.:
C23H38N4O
Mol. Mass.:
386.574
SMILES:
CCCCCCCCCCCCc1ccc(NC(=O)C2(CC2)NC(N)=N)cc1
: