Target
Sphingosine kinase 1
Ligand
BDBM174106
Substrate
Meas. Tech.
Scintillation Proximity Assay
Ki
>10000±n/a nM
Citation
 Santos, WLLynch, KRMacdonald, TLKennedy, AKharel, YRaje, MRHouck, J Long chain base sphingosine kinase inhibitors US Patent  US9688668 Publication Date 6/27/2017 
Target
Name:
Sphingosine kinase 1
Synonyms:
SK1 SPHK1 SPK Sphingosine kinase 1 (SPHK1) | Sphingosine kinase types 1 (SphK1)
Type:
Enzyme
Mol. Mass.:
42521.16
Organism:
Homo sapiens (Human)
Description:
Q9NYA1
Residue:
384
  
Inhibitor
Name:
BDBM174106
Synonyms:
US9688668, 58
Type:
Small organic molecule
Emp. Form.:
C21H31N5O
Mol. Mass.:
369.5037
SMILES:
CCCCCCCCc1cccc(c1)-c1noc(n1)[C@@H]1CCCN1C(N)=N
: