Target
Sphingosine kinase 1
Ligand
BDBM174113
Substrate
Meas. Tech.
Scintillation Proximity Assay
Ki
55000±n/a nM
Citation
 Santos, WLLynch, KRMacdonald, TLKennedy, AKharel, YRaje, MRHouck, J Long chain base sphingosine kinase inhibitors US Patent  US9688668 Publication Date 6/27/2017 
Target
Name:
Sphingosine kinase 1
Synonyms:
SK1 SPHK1 SPK Sphingosine kinase 1 (SPHK1) | Sphingosine kinase types 1 (SphK1)
Type:
Enzyme
Mol. Mass.:
42521.16
Organism:
Homo sapiens (Human)
Description:
Q9NYA1
Residue:
384
  
Inhibitor
Name:
BDBM174113
Synonyms:
US9688668, 63
Type:
Small organic molecule
Emp. Form.:
C22H33N5O
Mol. Mass.:
383.5303
SMILES:
CCCCCCCCCCc1ccc(cc1)-c1noc(n1)[C@@H]1CCN1C(N)=N
: