Target
Coagulation factor XI
Ligand
BDBM303786
Substrate
Meas. Tech.
Measurement of FXIa Inhibition
IC50
720±n/a nM
Citation
 Röhrig, SHillisch, AHeitmeier, SSchmidt, MVSchlemmer, KTersteegen, ASchäfer, MTeller, HJimènez Nùnez, E Factor xia-inhibiting pyridobenzazepine and pyridobenzazocine derivatives US Patent  US10138236 Publication Date 11/27/2018 
Target
Name:
Coagulation factor XI
Synonyms:
Coagulation factor XIa Coagulation factor XIa light chain FA11_HUMAN Factor XIa PTA | Plasma thromboplastin antecedent
Type:
Enzyme
Mol. Mass.:
70130.58
Organism:
Homo sapiens (Human)
Description:
P03951
Residue:
625
  
Inhibitor
Name:
BDBM303786
Synonyms:
4-{[(11-Chloro-2,5-dioxo-5,6,7,8-tetrahydropyrido[3,4-e][3]benzazocin-3(2H)-yl)acetyl]amino}benzoic acid | US10138236, Example 4
Type:
Small organic molecule
Emp. Form.:
C23H18ClN3O5
Mol. Mass.:
451.859
SMILES:
OC(=O)c1ccc(NC(=O)Cn2cc3c(cc2=O)-c2cc(Cl)ccc2CCNC3=O)cc1
: